{"text_format":"1","workbook":"xlsx","n_sheets":9,"sheets":["Instructions","3-Wheelers TCO Dashboard","Summary","Currency","Capital Cost","Financing","Operational Cost","TCO_1","References"],"not_rendered":{"charts":6,"images":12,"macros":1,"external_links":1,"defined_names":0,"comments":0,"pivot_tables":0},"unopened":[],"bounds":{"document_bytes":16777216,"sheet_cells":100000,"rows_first":2000,"rows_last":500,"rows_between":2000,"halvings":0,"cell_chars":16384,"cell_head_chars":4096},"cells_cut":0,"cells_raw":0,"read":"whole","date_system":"1900"}

{"sheet":"Instructions","index":0,"n_rows":42,"n_cols":6,"rows_kept":42,"cut":false,"hidden":false,"merged":[[9,1,9,3],[9,5,9,13],[1,1,1,13],[3,1,3,13],[5,1,5,8],[8,1,8,3],[8,5,8,13],[16,1,16,3],[16,5,16,13],[10,1,10,3],[10,5,10,13],[11,1,11,3],[11,5,13,13],[12,1,12,3],[14,1,14,13],[15,1,15,3],[15,5,15,13],[23,1,23,3],[23,5,23,13],[17,1,17,3],[17,5,17,13],[18,1,18,3],[18,5,18,13],[19,1,19,3],[19,5,19,13],[20,1,20,3],[20,5,20,13],[21,1,21,3],[21,5,21,13],[22,1,22,13],[30,1,30,3],[30,5,30,13],[24,1,24,3],[24,5,24,13],[25,1,25,3],[25,5,25,13],[26,1,26,3],[26,5,26,13],[27,1,27,3],[27,5,27,13],[28,1,28,13],[29,1,29,3],[29,5,29,13],[31,1,31,3],[31,5,31,13],[32,1,32,3],[32,5,32,13],[33,1,33,3],[33,5,33,13],[41,1,42,14],[34,1,34,3],[34,5,34,13],[35,1,35,3],[35,5,35,13],[36,1,36,3],[36,5,36,13]]}
[]
[null,"HOW TO USE THE DYNAMIC TOTAL COST OF OWNERSHIP DASHBOARD"]
[]
[null,"All cells highlighted Green are Input cells. Values can only be edited in these cells to observe the dynamic changes in the dashboard on the right."]
[]
[null,"All cells highlighted Gray are Fixed cells. These values cannot be edited."]
[]
[]
[null,"CELL NAME",null,null,"FUNCTION","ACTION REQUIRED"]
[null,"Vehicle Holding Period (Year)",null,null,"Editable","Use the drop down menu on Cell C5 to choose the Vehicle holding period from 1 to 10 years "]
[null,"Daily Distance Travelled (km)",null,null,"Editable","Use the arrows on the right to increase/decrease to input Daily Distance Travelled in km"]
[null,"Daily Distance Travelled (mi)",null,null,"Fixed"]
[null,"Annual Distance Travelled (km)",null,null,"Fixed"]
[null,"Annual Distance Travelled (mi)",null,null,"Fixed"]
[]
{"$rows_left_out":28}
{"sheet":"3-Wheelers TCO Dashboard","index":1,"n_rows":61,"n_cols":54,"rows_kept":61,"cut":false,"hidden":false,"merged":[[2,1,2,3],[14,3,14,5],[16,2,16,5],[4,3,4,5]]}
[null,null,null,null,null,null,null,null,null,null,null,null,null,null,null,null,null,null,null,null,null,null,null,null,null,null,null,null,null,null,null,null,null,null,null,null,null,null,null,null,null,null,"YEAR 10","TCO",null,null,null,null,null,"DYNAMIC","TCO"]
[null,null,null,null,null,null,null,null,null,null,null,null,null,null,null,null,null,null,null,null,null,null,null,null,null,null,null,null,null,null,null,null,null,null,null,null,null,null,null,null,null,null,"e-3W",{"$f":"TCO_1!C11","v":4.2065260112095348},null,null,null,null,null,"e-3W",{"$f":"VLOOKUP($C$5,$AX$8:$BB$18,2,0)","v":5.6794656553919829}]
[null,null,null,null,null,null,null,null,null,null,null,null,null,null,null,null,null,null,null,null,null,null,null,null,null,null,null,null,null,null,null,null,null,null,null,null,null,null,null,null,null,null,"CNG - 3W",{"$f":"TCO_1!D11","v":4.430237384445614},null,null,null,null,null,"CNG - 3W",{"$f":"VLOOKUP($C$5,$AX$8:$BB$18,3,0)","v":5.8864396629986606}]
[null,null,null,null,null,null,null,null,null,null,null,null,null,null,null,null,null,null,null,null,null,null,null,null,null,null,null,null,null,null,null,null,null,null,null,null,null,null,null,null,null,null,"Petrol - 3W",{"$f":"TCO_1!E11","v":6.4360346047368564},null,null,null,null,null,"Petrol - 3W",{"$f":"VLOOKUP($C$5,$AX$8:$BB$18,4,0)","v":8.3685419332834776}]
[null,"Vehicle Holding Period (Year)",5,"              Use Drop down to choose Holding Period",null,null,null,null,null,null,null,null,null,null,null,null,null,null,null,null,null,null,null,null,null,null,null,null,null,null,null,null,null,null,null,null,null,null,null,null,null,null,"Diesel - 3W",{"$f":"TCO_1!F11","v":5.4981039622685755},null,null,null,null,null,"Diesel - 3W",{"$f":"VLOOKUP($C$5,$AX$8:$BB$18,5,0)","v":7.2078712091354404}]
[]
[null,"Daily Drive Distance (km)",110,null,"(Use Arrows to input Distance)"]
[null,"Daily Drive Distance (mi)",{"$f":"C7*0.621371","v":68.350809999999996},null,null,null,null,null,null,null,null,null,null,null,null,null,null,null,null,null,null,null,null,null,null,null,null,null,null,null,null,null,null,null,null,null,null,null,null,null,null,null,"Operational Years","e-3W","CNG - 3W","Petrol - 3W","Diesel - 3W",null,null,null,"e-3W","CNG - 3W","Petrol - 3W","Diesel - 3W"]
[null,null,null,null,null,null,null,null,null,null,null,null,null,null,null,null,null,null,null,null,null,null,null,null,null,null,null,null,null,null,null,null,null,null,null,null,null,null,null,null,null,null,"Year 1",{"$f":"TCO_1!C31","v":13.599857251247432},{"$f":"TCO_1!C34","v":12.494582351177874},{"$f":"TCO_1!C37","v":15.564205836876578},{"$f":"TCO_1!C40","v":14.128605665329651},null,null,1,{"$f":"IF($C$5=AX9,AR9:AU9,)","v":0}]
[null,"Annual Drive Distance (km)",{"$f":"C7*365","v":40150},null,null,null,null,null,null,null,null,null,null,null,null,null,null,null,null,null,null,null,null,null,null,null,null,null,null,null,null,null,null,null,null,null,null,null,null,null,null,null,"Year 2",{"$f":"TCO_1!D31","v":8.8572225000131155},{"$f":"TCO_1!D34","v":8.6341341873004573},{"$f":"TCO_1!D37","v":11.507669742890378},{"$f":"TCO_1!D40","v":10.163890474808259},null,null,2,{"$f":"IF($C$5=AX10,AR10:AU10,)","v":0}]
[null,"Annual Drive Distance (mi)",{"$f":"C8*365","v":24948.04565},null,null,null,null,null,null,null,null,null,null,null,null,null,null,null,null,null,null,null,null,null,null,null,null,null,null,null,null,null,null,null,null,null,null,null,null,null,null,null,"Year 3",{"$f":"TCO_1!E31","v":7.1779902686101611},{"$f":"TCO_1!E34","v":7.2197147125510988},{"$f":"TCO_1!E37","v":9.9470458014386942},{"$f":"TCO_1!E40","v":8.6716740317125627},null,null,3,{"$f":"IF($C$5=AX11,AR11:AU11,)","v":0}]
[null,null,null,null,null,null,null,null,null,null,null,null,null,null,null,null,null,null,null,null,null,null,null,null,null,null,null,null,null,null,null,null,null,null,null,null,null,null,null,null,null,null,"Year 4",{"$f":"TCO_1!F31","v":6.2716129690405449},{"$f":"TCO_1!F34","v":6.4257403856386786},{"$f":"TCO_1!F37","v":9.0248539001722357},{"$f":"TCO_1!F40","v":7.8094570503491099},null,null,4,{"$f":"IF($C$5=AX12,AR12:AU12,)","v":0}]
[null,null,null,null,null,null,null,null,null,null,null,null,null,null,null,null,null,null,null,null,null,null,null,null,null,null,null,null,null,null,null,null,null,null,null,null,null,null,null,null,null,null,"Year 5",{"$f":"TCO_1!G31","v":5.6794656553919829},{"$f":"TCO_1!G34","v":5.8864396629986606},{"$f":"TCO_1!G37","v":8.3685419332834776},{"$f":"TCO_1!G40","v":7.2078712091354404},null,null,5,{"$f":"IF($C$5=AX13,AR13:AU13,)","v":5.6794656553919829},5.8864396629986606,8.3685419332834776,7.2078712091354404]
[null,null,null,null,null,null,null,null,null,null,null,null,null,null,null,null,null,null,null,null,null,null,null,null,null,null,null,null,null,null,null,null,null,null,null,null,null,null,null,null,null,null,"Year 6",{"$f":"TCO_1!H31","v":5.2482825920719129},{"$f":"TCO_1!H34","v":5.4793923881925428},{"$f":"TCO_1!H37","v":7.8531255773379156},{"$f":"TCO_1!H40","v":6.7431355833561177},null,null,6,{"$f":"IF($C$5=AX14,AR14:AU14,)","v":0}]
[null,null,"INR",null,null,null,null,null,null,null,null,null,null,null,null,null,null,null,null,null,null,null,null,null,null,null,null,null,null,null,null,null,null,null,null,null,null,null,null,null,null,null,"Year 7",{"$f":"TCO_1!I31","v":4.9120737707193269},{"$f":"TCO_1!I34","v":5.1517458787744062},{"$f":"TCO_1!I37","v":7.4244163510991461},{"$f":"TCO_1!I40","v":6.3616881917776471},null,null,7,{"$f":"IF($C$5=AX15,AR15:AU15,)","v":0}]
{"$rows_left_out":47}
{"sheet":"Summary","index":2,"n_rows":30,"n_cols":5,"rows_kept":30,"cut":false,"hidden":false,"merged":[[0,0,0,1]]}
["TRAVEL DETAILS"]
["Number of Vehicle",1]
["Life of Vehicle (yrs)",10]
["Annual drive distance (KM)",{"$f":"'3-Wheelers TCO Dashboard'!C10","v":40150}]
["Total Distance Travel (KM)",{"$f":"B3*B4","v":401500}]
["LIB Cost (USD/kWh)",{"$f":"'3-Wheelers TCO Dashboard'!C41","v":137}]
["USD to INR",73]
[]
["General Inputs","e-3W ","CNG-3W","Petrol-3W","Diesel-3W"]
["Discount rate (%)",{"$f":"'3-Wheelers TCO Dashboard'!C25","v":0.1},{"$f":"'3-Wheelers TCO Dashboard'!D25","v":0.1},{"$f":"'3-Wheelers TCO Dashboard'!E25","v":0.1},{"$f":"'3-Wheelers TCO Dashboard'!F25","v":0.1}]
["Resale rate (%)",{"$f":"'3-Wheelers TCO Dashboard'!C26","v":0.2},{"$f":"'3-Wheelers TCO Dashboard'!D26","v":0.1},{"$f":"'3-Wheelers TCO Dashboard'!E26","v":0.1},{"$f":"'3-Wheelers TCO Dashboard'!F26","v":0.1}]
[]
["Capital Cost","e-3W ","CNG-3W","Petrol-3W","Diesel-3W"]
["Total Vehicle Cost (₹)",{"$f":"'Capital Cost'!B8","v":521280.59444580117},{"$f":"'Capital Cost'!C8","v":310334.37000414531},{"$f":"'Capital Cost'!D8","v":315665.37000414531},{"$f":"'Capital Cost'!E8","v":313161.37000414531}]
["Resale Value (₹)",{"$f":"B14*(B11/100)","v":1042.5611888916023},{"$f":"C14*(C11/100)","v":310.33437000414534},{"$f":"D14*(D11/100)","v":315.6653700041453},{"$f":"E14*(E11/100)","v":313.16137000414534}]
{"$rows_left_out":16}
{"sheet":"Currency","index":3,"n_rows":55,"n_cols":10,"rows_kept":55,"cut":false,"hidden":true,"merged":[[19,7,19,8],[6,9,7,9],[1,1,1,3],[15,1,15,2],[15,4,15,5],[15,7,15,8],[1,6,1,7]]}
[]
[null,"CURRENCY CONVERSION",null,null,null,null,"WEIGHT CONVERSION"]
[]
[null,"USD","INR","Conversion",null,null,"gal","L"]
[null,1,74,{"$f":"B5*C5","v":74},null,null,1,3.78]
[]
[null,"EURO","INR","Conversion",null,null,"GGE","Kg",null,"NIST Handbook 44 Appendix D (Pg 3-110) as follows: \"1 Gasoline [US] gallon equivalent (GGE) means 2.567 kg (5.660 lb) of natural gas\""]
[null,1,82,{"$f":"B8*C8","v":82},null,null,1,2.5670000000000002]
[]
[]
[]
[]
[]
[]
[]
{"$rows_left_out":41}
{"sheet":"Capital Cost","index":4,"n_rows":42,"n_cols":5,"rows_kept":42,"cut":false,"hidden":true,"merged":[[23,0,23,4],[28,0,28,4],[33,0,33,4],[38,0,38,4]]}
["Vehicle Cost","e-3W ","CNG-3W","Petrol-3W","Diesel-3W"]
["Purchase Cost (₹)",{"$f":"VLOOKUP('3-Wheelers TCO Dashboard'!$C$15,'Capital Cost'!$A$25:$E$27,2,0)","v":366906},{"$f":"VLOOKUP('3-Wheelers TCO Dashboard'!$C$15,'Capital Cost'!$A$25:$E$27,3,0)","v":240000},{"$f":"VLOOKUP('3-Wheelers TCO Dashboard'!$C$15,'Capital Cost'!$A$25:$E$27,4,0)","v":240000},{"$f":"VLOOKUP('3-Wheelers TCO Dashboard'!$C$15,'Capital Cost'!$A$25:$E$27,5,0)","v":240000}]
["Tax (₹)",{"$f":"VLOOKUP('3-Wheelers TCO Dashboard'!$C$15,'Capital Cost'!$A$30:$E$32,2,0)","v":4000},{"$f":"VLOOKUP('3-Wheelers TCO Dashboard'!$C$15,'Capital Cost'!$A$30:$E$32,3,0)","v":4549},{"$f":"VLOOKUP('3-Wheelers TCO Dashboard'!$C$15,'Capital Cost'!$A$30:$E$32,4,0)","v":9055},{"$f":"VLOOKUP('3-Wheelers TCO Dashboard'!$C$15,'Capital Cost'!$A$30:$E$32,5,0)","v":4638}]
["Insurance (₹)",{"$f":"VLOOKUP('3-Wheelers TCO Dashboard'!$C$15,'Capital Cost'!$A$35:$E$37,2,0)","v":2500},{"$f":"VLOOKUP('3-Wheelers TCO Dashboard'!$C$15,'Capital Cost'!$A$35:$E$37,3,0)","v":1680},{"$f":"VLOOKUP('3-Wheelers TCO Dashboard'!$C$15,'Capital Cost'!$A$35:$E$37,4,0)","v":2505},{"$f":"VLOOKUP('3-Wheelers TCO Dashboard'!$C$15,'Capital Cost'!$A$35:$E$37,5,0)","v":4418}]
["Financing Component (₹)",{"$f":"Financing!B17","v":147874.59444580117},{"$f":"Financing!C17","v":64105.370004145312},{"$f":"Financing!D17","v":64105.370004145312},{"$f":"Financing!E17","v":64105.370004145312}]
["Total Financial Incentive (₹)",0,0,0,0]
["Misc. Cost (₹)",0,0,0,0]
["Total Vehicle Cost (₹)",{"$f":"((B2+B3+B4+B5+B7)-B6)","v":521280.59444580117},{"$f":"((C2+C3+C4+C5+C7)-C6)","v":310334.37000414531},315665.37000414531,313161.37000414531]
[]
["Charging Infrastructure Cost","e-3W ","CNG-3W","Petrol-3W","Diesel-3W"]
["No. of Slow Charger (SC)",0,0,0,0]
["Cost of SC per unit (₹)",0,0,0,0]
["Total Cost of SC (₹)",{"$f":"B11*B12","v":0},{"$f":"C11*C12","v":0},{"$f":"D11*D12","v":0},0]
["No. of Fact Charger (FC)",0,0,0,0]
["Cost of FC per unit (₹)",0,0,0,0]
{"$rows_left_out":28}
{"sheet":"Financing","index":5,"n_rows":24,"n_cols":5,"rows_kept":24,"cut":false,"hidden":true,"merged":[[20,0,20,4],[25,0,25,4]]}
["Vehicle Cost","e-2W (VRLA)","e-2W (LIB_SB)","e-2W (LIB_BB)","Petrol-2W"]
["Total Cost of Bike (₹)",{"$f":"'3-Wheelers TCO Dashboard'!C20-'3-Wheelers TCO Dashboard'!C23","v":300383},{"$f":"'3-Wheelers TCO Dashboard'!D20","v":240000},{"$f":"'3-Wheelers TCO Dashboard'!E20","v":240000},{"$f":"'3-Wheelers TCO Dashboard'!F20","v":240000}]
["Share of Operator (%)",{"$f":"100%-B6","v":0.85},{"$f":"100%-C6","v":0.85},0.85,0.85]
["Share of Operator (₹)",{"$f":"B3*B2","v":255325.55},{"$f":"C3*C2","v":204000},{"$f":"D3*D2","v":204000},{"$f":"E3*E2","v":204000}]
["Processing  Fees",{"$f":"IF(B8=0,0,IF(B4*0.5%>500,B4*0.5%,500))","v":1276.6277499999999},{"$f":"IF(C8=0,0,IF(C4*0.5%>500,C4*0.5%,500))","v":1020},1020,1020]
["Equity %",{"$f":"'3-Wheelers TCO Dashboard'!C31","v":0.15},{"$f":"'3-Wheelers TCO Dashboard'!D31","v":0.15},{"$f":"'3-Wheelers TCO Dashboard'!E31","v":0.15},{"$f":"'3-Wheelers TCO Dashboard'!F31","v":0.15}]
["Equity (₹)",{"$f":"(B6*B2)","v":45057.45},{"$f":"(C6*C2)","v":36000},{"$f":"(D6*D2)","v":36000},{"$f":"(E6*E2)","v":36000}]
["Loan amount (₹)",{"$f":"B4","v":255325.55},{"$f":"C4","v":204000},{"$f":"D4","v":204000},{"$f":"E4","v":204000}]
["Interest rate (%)",{"$f":"'3-Wheelers TCO Dashboard'!C30","v":0.14000000000000001},{"$f":"'3-Wheelers TCO Dashboard'!D30","v":0.08},{"$f":"'3-Wheelers TCO Dashboard'!E30","v":0.08},{"$f":"'3-Wheelers TCO Dashboard'!F30","v":0.08}]
["Term of payment (yrs)",{"$f":"'3-Wheelers TCO Dashboard'!C29","v":7},{"$f":"'3-Wheelers TCO Dashboard'!D29","v":7},{"$f":"'3-Wheelers TCO Dashboard'!E29","v":7},{"$f":"'3-Wheelers TCO Dashboard'!F29","v":7}]
["No of EMI (Yearly)",{"$f":"B10*12","v":84},{"$f":"C10*12","v":84},84,84]
["Monthly EMI Loan (Rs.)",{"$f":"((PMT(B9/12,B10*12,-B8))+(B5/B11))","v":4800.0017195928704},{"$f":"((PMT(C9/12,C10*12,-C8))+(C5/C11))","v":3191.730595287444},3191.730595287444,3191.730595287444]
["Total interest paid",{"$f":"(B12*B10*12)-B8","v":147874.59444580117},{"$f":"(C12*C10*12)-C8","v":64105.370004145312},64105.370004145312,64105.370004145312]
["Yearly Interest Paid",{"$f":"B13/B10","v":21124.942063685881},{"$f":"C13/C10","v":9157.9100005921882},{"$f":"D13/D10","v":9157.9100005921882},{"$f":"E13/E10","v":9157.9100005921882}]
["EMI per KM (Rs.)",{"$f":"B14/Summary!$B$4","v":0.52615048726490365},{"$f":"C14/Summary!$B$4","v":0.22809240350167342},{"$f":"D14/Summary!$B$4","v":0.22809240350167342},{"$f":"E14/Summary!$B$4","v":0.22809240350167342}]
{"$rows_left_out":10}
{"sheet":"Operational Cost","index":6,"n_rows":47,"n_cols":5,"rows_kept":47,"cut":false,"hidden":true,"merged":[[33,0,33,4],[38,0,38,4],[43,0,43,4]]}
["Staff cost","e-3W ","CNG-3W","Petrol-3W","Diesel-3W"]
["Staff Cost (₹ / Month)",{"$f":"VLOOKUP('3-Wheelers TCO Dashboard'!$C$15,'Operational Cost'!$A$35:$B$37,2,0)","v":10000},{"$f":"VLOOKUP('3-Wheelers TCO Dashboard'!$C$15,'Operational Cost'!$A$35:$B$37,2,0)","v":10000},{"$f":"VLOOKUP('3-Wheelers TCO Dashboard'!$C$15,'Operational Cost'!$A$35:$B$37,2,0)","v":10000},{"$f":"VLOOKUP('3-Wheelers TCO Dashboard'!$C$15,'Operational Cost'!$A$35:$B$37,2,0)","v":10000}]
["Other Support staff cost (₹ / Month)",0,0,0,0]
["Total Annual Staff Cost (₹)",{"$f":"((B2+B3)*12)","v":120000},{"$f":"((C2+C3)*12)","v":120000},120000,120000]
["Per km Staff Cost",{"$f":"B4/Summary!$B$4","v":2.9887920298879203},{"$f":"C4/Summary!$B$4","v":2.9887920298879203},{"$f":"D4/Summary!$B$4","v":2.9887920298879203},{"$f":"E4/Summary!$B$4","v":2.9887920298879203}]
[]
["Average Fuel Cost","e-3W ","CNG-3W","Petrol-3W","Diesel-3W"]
["Fuel cost (₹/kWh; ₹/kg; ₹/L)",{"$f":"VLOOKUP('3-Wheelers TCO Dashboard'!$C$15,'Operational Cost'!$A$45:$E$47,2,0)","v":6},{"$f":"VLOOKUP('3-Wheelers TCO Dashboard'!$C$15,'Operational Cost'!$A$45:$E$47,3,0)","v":47},{"$f":"VLOOKUP('3-Wheelers TCO Dashboard'!$C$15,'Operational Cost'!$A$45:$E$47,4,0)","v":100},{"$f":"VLOOKUP('3-Wheelers TCO Dashboard'!$C$15,'Operational Cost'!$A$45:$E$47,5,0)","v":88}]
["Mileage (km/kWh; km/kg; km/L)",{"$f":"'3-Wheelers TCO Dashboard'!C47","v":10},{"$f":"'3-Wheelers TCO Dashboard'!D47","v":28.4},{"$f":"'3-Wheelers TCO Dashboard'!E47","v":20.100000000000001},{"$f":"'3-Wheelers TCO Dashboard'!F47","v":25.4}]
["Annual fuel consumption (kWh; L)",{"$f":"Summary!B4/B9","v":4015},{"$f":"Summary!B4/C9","v":1413.7323943661972},{"$f":"Summary!B4/D9","v":1997.5124378109451},{"$f":"Summary!$B$4/E9","v":1580.7086614173229}]
["Total Annual Fuel Cost ( ₹ )",{"$f":"(B10*B8)","v":24090},{"$f":"(C10*C8)","v":66445.42253521127},{"$f":"(D10*D8)","v":199751.24378109453},{"$f":"(E10*E8)","v":139102.36220472443}]
["Per km Fuel Cost",{"$f":"B11/Summary!$B$4","v":0.6},{"$f":"C11/Summary!$B$4","v":1.6549295774647887},{"$f":"D11/Summary!$B$4","v":4.9751243781094523},{"$f":"E11/Summary!$B$4","v":3.4645669291338588}]
[]
["Maintenance Cost","e-3W ","CNG-3W","Petrol-3W","Diesel-3W"]
["Annual Maintenance Cost (₹)",{"$f":"VLOOKUP('3-Wheelers TCO Dashboard'!$C$15,'Operational Cost'!$A$40:$E$42,2,0)","v":10401},{"$f":"VLOOKUP('3-Wheelers TCO Dashboard'!$C$15,'Operational Cost'!$A$40:$E$42,3,0)","v":21005},{"$f":"VLOOKUP('3-Wheelers TCO Dashboard'!$C$15,'Operational Cost'!$A$40:$E$42,4,0)","v":17405},{"$f":"VLOOKUP('3-Wheelers TCO Dashboard'!$C$15,'Operational Cost'!$A$40:$E$42,5,0)","v":17405}]
{"$rows_left_out":33}
{"sheet":"TCO_1","index":7,"n_rows":40,"n_cols":13,"rows_kept":40,"cut":false,"hidden":true,"merged":[]}
["Parameter","Unit","e-3W ","CNG-3W","Petrol-3W","Diesel-3W"]
["Discount rate value","-",{"$f":"Summary!B10","v":0.1},{"$f":"Summary!C10","v":0.1},{"$f":"Summary!D10","v":0.1},{"$f":"Summary!E10","v":0.1}]
["Resale rate value","-",{"$f":"Summary!B11","v":0.2},{"$f":"Summary!C11","v":0.1},{"$f":"Summary!D11","v":0.1},{"$f":"Summary!E11","v":0.1}]
["Capital recovery factor (CRF)_N","-",{"$f":"C2*(1+C2)^Summary!B3","v":0.2593742460100002},{"$f":"D2*(1+D2)^Summary!B3","v":0.2593742460100002},{"$f":"E2*(1+E2)^Summary!B3","v":0.2593742460100002},{"$f":"F2*(1+F2)^Summary!B3","v":0.2593742460100002}]
["Capital recovery factor (CRF)_D","-",{"$f":"((1+C2)^Summary!B3)-1","v":1.5937424601000019},{"$f":"(1+D2)^Summary!B3-1","v":1.5937424601000019},{"$f":"(1+E2)^Summary!B3-1","v":1.5937424601000019},{"$f":"(1+F2)^Summary!B3-1","v":1.5937424601000019}]
["CRF","-",{"$f":"C4/C5","v":0.16274539488251155},{"$f":"D4/D5","v":0.16274539488251155},{"$f":"E4/E5","v":0.16274539488251155},{"$f":"F4/F5","v":0.16274539488251155}]
["Present value factor (PVF)","-",{"$f":"1/(1+C2)^10","v":0.38554328942953148},{"$f":"1/(1+D2)^Summary!B3","v":0.38554328942953148},{"$f":"1/(1+E2)^Summary!B3","v":0.38554328942953148},{"$f":"1/(1+F2)^Summary!B3","v":0.38554328942953148}]
["Residual value (RV)","₹",{"$f":"Summary!B14*C3","v":104256.11888916024},{"$f":"Summary!C14*D3","v":31033.437000414531},{"$f":"Summary!D14*E3","v":31566.537000414533},{"$f":"Summary!E14*F3","v":31316.137000414532}]
["Annual  Travel Distance","km",{"$f":"Summary!$B$4","v":40150},{"$f":"Summary!$B$4","v":40150},{"$f":"Summary!$B$4","v":40150},{"$f":"Summary!$B$4","v":40150}]
["Capex component","₹",{"$f":"((Summary!B19-(C8*C7))*C6)","v":67468.112935284531},{"$f":"(Summary!C19-(D8*D7))*D6","v":48558.284332787523},{"$f":"(Summary!D19-(E8*E7))*E6","v":49392.430462894328},{"$f":"(Summary!E19-(F8*F7))*F6","v":49000.627440987097}]
["TCO","₹/km",{"$f":"(C10+L22)/C9","v":4.2065260112095348},{"$f":"(D10+L23)/D9","v":4.430237384445614},{"$f":"(E10+L24)/E9","v":6.4360346047368564},{"$f":"(F10+L25)/F9","v":5.4981039622685755}]
[]
["Opex / year"]
["Vehicle type","Unit",1,{"$f":"C14+1","v":2},3,4,5,6,7,8,9,10,"Total"]
["e-3W ","₹",{"$f":"Summary!$B$27/(1+$C$2)^C14","v":150057.03363636363},{"$f":"Summary!$B$27/(1+$C$2)^D14","v":136415.48512396691},{"$f":"Summary!$B$27/(1+$C$2)^E14","v":124014.07738542445},{"$f":"Summary!$B$27/(1+$C$2)^F14","v":112740.07035038587},{"$f":"Summary!$B$27/(1+$C$2)^G14","v":102490.97304580532},{"$f":"Summary!$B$27/(1+$C$2)^H14","v":93173.61185982301},{"$f":"Summary!$B$27/(1+$C$2)^I14","v":84703.283508930006},{"$f":"Summary!$B$27/(1+$C$2)^J14","v":77002.985008118194},{"$f":"Summary!$B$27/(1+$C$2)^K14","v":70002.713643743802},{"$f":"Summary!$B$27/(1+$C$2)^L14","v":63638.830585221629},{"$f":"SUM(C15:L15)/Summary!B3","v":101423.90641477828}]
{"$rows_left_out":26}
{"sheet":"References","index":8,"n_rows":37,"n_cols":12,"rows_kept":37,"cut":false,"hidden":true,"merged":[]}
[]
[null,"Assumption",null,null,null,"Source"]
[null,"Life of Vehicle",null,null,null,"Assumed"]
[null,"Annual driving distance",null,null,null,"Assumed"]
[null,"Total distance travelled",null,null,null,"Assumed"]
[null,"LIB cost",null,null,null,"https://bnef.turtl.co/story/evo2018?teaser=true ",null,null,null,null,"BNEF EV Outlook 2018 ($200/kWh)"]
[null,"Discount rate",null,null,null,"Assumed","https://www.goodreturns.in/diesel-price-in-new-delhi.html"]
[null,"Resale value",null,null,null,"Assumed"]
[null,"Purchase cost (e-3W)",null,null,null,"http://www.mahindraelectric.com/car-price-list/",null,null,null,null,"(treo SFT)","Excluding FAME subsidy Rs. 61,000 https://www.fame-india.gov.in/ModelUnderFame.aspx"]
[null,"Purchase cost (CNG 3W)",null,null,null,"http://www.vicky.in/trucks/bajaj/re-compact-4s/on-road-price-in-delhi/"]
[null,"Purchase cost (Petrol 3W)",null,null,null,"Assumed to be same as CNG 3W"]
[null,"Purchase cost (Diesel 3W)",null,null,null,"Assumed to be same as CNG 3W"]
[null,"Tax",null,null,null,"http://www.vicky.in/trucks/bajaj/re-compact-4s/on-road-price-in-delhi/"]
[null,"Insurance",null,null,null,"http://www.vicky.in/trucks/bajaj/re-compact-4s/on-road-price-in-delhi/"]
[null,"Misc. Cost (e-3W)",null,null,null,"Based on interview of auto drivers & some dealers (BLR)"]
{"$rows_left_out":22}